مهاجم
type: Concept
broader: رمزنگاری
preferred label: attacker @en
scope note: عامل متجاوزی است که سعی بر ایجاد اختلال در پیام ها را دارد یا برای رسیدن به هدف خود علیه قوانین پروتکل عمل می کند.

رمزنگاری
type: Concept
narrower: مهاجم
preferred label: cryptography @en