پیچیدگی فضایی
type: Concept
broader: نظریه پیچیدگی محاسباتی
preferred label: spatial complexity @en
scope note: تعداد سلولهای حافظه مورد نیاز برای انجام محاسبات.

نظریه پیچیدگی محاسباتی
type: Concept
narrower: پیچیدگی فضایی
preferred label: computational complexity theory @en