دایره‌البروج
type: Concept
broader: کره سماوی
preferred label: ecliptic @en
scope note: حرکت سالانه خورشید به دورزمین روی کره سماوی.

کره سماوی
type: Concept
narrower: دایره‌البروج
preferred label: celestial sphere @en