آزمون فیشر-ایروین
type: Concept
broader: نظریه آزمون فرض
preferred label: Fischer-Irwin test @en
scope note: روشی برای آزمودن فرض صفر در آزمایشی با چندین پاسخ.

نظریه آزمون فرض
type: Concept
narrower: آزمون فیشر-ایروین
preferred label: theory of hypothesis testing @en