روش تجزیه آدومین
type: Concept
broader: روش آدومین
preferred label: Adomian decomposition method @en
related: معادله دافینگ
scope note: این روش زمانی برای معادلات دیفرانسیل جزیی به کار می رود که جواب دقیق در دسترس نباشد. در این روش از سری قطع شده استفاده می شود. اما سری جواب ممکن است دارای شعاع همگرایی کوچک باشد و سری قطع شده در بسیاری از نواحی دقیق نباشد.

روش آدومین
type: Concept
narrower: روش تجزیه آدومین
preferred label: Adomian method @en

معادله دافینگ
type: Concept
preferred label: Duffing equation @en
related: روش تجزیه آدومین