تعالی پینلوف
type: Concept
broader: ویژگی پینلوف
preferred label: Painleve transcendent @en
scope note: شش تعالی پینلوف وجود دارد که متناظر با معادلات دیفرانسیل معمولی مرتبه دومی می باشد که دارای تکینی متحرک هستند و این تکینی ها قطب های معمولی نیز می باشند .

ویژگی پینلوف
type: Concept
narrower: تعالی پینلوف
preferred label: Painleve property @en