نوسانگر وان در پول
type: Concept
preferred label: Van der Pol oscillator @en
related: نوسانگر واهلش

نوسانگر واهلش
type: Concept
broader: نوسانگر
preferred label: relaxation oscillator @en
related: نوسانگر وان در پول
scope note: نوسانگری است که در آن یک باطری به تدریج شارژ می شود و به سرعت شارژ خالی می کند.

نوسانگر
type: Concept
narrower: نوسانگر واهلش
preferred label: oscillator @en