قوانین دمورگان
type: Concept
broader: قاعده
preferred label: de Morgan 's rules @en
related: مجموعه متمم
scope note: متمم اجتماع دو مجموعه برابر است با اشتراک متمم های آنها و متمم اشتراک دو مجموعه برابر است با اجتماع متمم های آنها.

قاعده
type: Concept
narrower: قوانین دمورگان
preferred label: rule @en

مجموعه متمم
type: Concept
preferred label: complement set @en
related: قوانین دمورگان