مجموعه شبه‌مرتب
type: Concept
preferred label: quasi-ordered set @en
related: مجموعه سودار

مجموعه سودار
type: Concept
alternative label: مجموعه جهت‌دار
broader: مجموعه جزئامرتب
preferred label: directed set @en
related: مجموعه شبه‌مرتب
scope note: به ازای هر جفت از اعضای مجموعه ، عضو سومی هست که از هر دوی آنها بزرگتر است.

مجموعه جزئامرتب
type: Concept
narrower: مجموعه سودار
preferred label: partially ordered set @en