گراف میانه
type: Concept
preferred label: median graph @en
related: مشبکه توزیع‌پذیر

مشبکه توزیع‌پذیر
type: Concept
broader: مشبکه
preferred label: distributive lattice @en
related: گراف میانه
scope note: مشبکه ای که در آن اینفیمم مجموعه از یک قانون توزیع پذیری نسبت به سوپریمم آن تبعیت می کند.

مشبکه
type: Concept
narrower: مشبکه توزیع‌پذیر
preferred label: lattice (ordered set) @en