تایپ کامل
type: Concept
broader: تایپ
preferred label: complete type @en
scope note: مجموعه ای سازگار از فرمولها با درایه مشخص که نسبت به "و" بسته باشد (به ازای هر فرمول با درایه مشخص خود فرمول و یا نقیض آن در تایپ قرار دارد).

تایپ
type: Concept
narrower: تایپ کامل
preferred label: type @en