فرایند اف
type: Concept
broader: فرایندها
preferred label: F-process @en
scope note: فرایندی تصادفی که مقدارش در زمان t به وسیله اطلاعات به دست آمده تا زمان t تعیین می‌شود.

فرایندها
type: Concept
narrower: فرایند اف
preferred label: processes @en