اعداد اول دوقلو
type: Concept
broader: عدد اول
preferred label: twin numbers @en
scope note: اعداد اول که تفاضل شان 2 باشد، اعداد دوقلو نامیده می شوند.

عدد اول
type: Concept
narrower: اعداد اول دوقلو
preferred label: prime number @en