مسئله نویمان
type: Concept
alternative label: دومین مساله مقدار مرزی
broader: تصویر الکتریکی
preferred label: Neumann problem @en
related: دومین قضیه بنیادی وجود
scope note: تعیین تابع همسازی در درون ناحیه ای متناهی از فضای سه بعدی که محصور در رویه ای بسته است هرگاه مشتق های قائم آن تابع روی آن رویه مشخص باشند.

تصویر الکتریکی
type: Concept
narrower: مسئله نویمان
preferred label: electric image @en

دومین قضیه بنیادی وجود
type: Concept
preferred label: second fundamental existence theorem @en
related: مسئله نویمان