تابع یکنوا
type: Concept
preferred label: monotonic function @en
related: تقریب هم‌یکنوا

تقریب هم‌یکنوا
type: Concept
broader: تقریب
preferred label: comonotone approximation @en
related: تابع یکنوا
scope note: تقریب یک تابع یکنوا، تکه ای پیوسته توسط یک چندجمله ای با یکنوایی یکسان.

تقریب
type: Concept
narrower: تقریب هم‌یکنوا
preferred label: approximation @en