عملگر افزاینده
type: Concept
broader: عملگر خطی
preferred label: accretive operator @en
scope note: عملگری خطی که بر زیرفضایی از یک فضای هیلبرت تعریف می شود و قسمت حقیقی حاصل ضرب داخلی تصویر هر عضو آن زیرفضا تحت عملگر مذکور نامنفی است.

عملگر خطی
type: Concept
narrower: عملگر افزاینده
preferred label: linear operator @en