دایره
type: Concept
preferred label: circle @en
related: قطاع کروی

قطاع کروی
type: Concept
broader: جسم دوار
preferred label: spherical sector @en
related: دایره
scope note: جسمی حاصل از دوران قطاعی از یک دایره حول قطری از آن دایره.

جسم دوار
type: Concept
narrower: قطاع کروی
preferred label: solid of revolution @en