مخروط مستدیر مایل
type: Concept
broader: مخروط مستدیر
preferred label: oblique circular cone @en
scope note: مخروط مستدیر که محور آن عمود بر قاعده اش نیست.

مخروط مستدیر
type: Concept
narrower: مخروط مستدیر مایل
preferred label: circular cone @en