بردار هم‌وردا
type: Concept
broader: تانسور هم‌وردا
preferred label: covariant vector @en
scope note: تانسوری هموردا از درجه یک، مانند گرادیان تابع.

تانسور هم‌وردا
type: Concept
narrower: بردار هم‌وردا
preferred label: covariant tensor @en