هم‌مرزی مختلط
type: Concept
preferred label: complex cobordism @en
related: کره نامتعارف

کره نامتعارف
type: Concept
alternative label: کره عجیب
broader: هندسه دیفرانسیل
preferred label: exotic sphere @en
related: هم‌مرزی مختلط
scope note: خمینه همواری که همسان ریخت با کره است ولی وابرریخت با آن نیست.

هندسه دیفرانسیل
type: Concept
narrower: کره نامتعارف
preferred label: differential geometry @en