امتدادهای مشخصه
type: Concept
preferred label: characteristic directions @en
related: خم مشخصه

خم مشخصه
type: Concept
alternative label: منحنی مشخصه
broader: هندسه دیفرانسیل خم ها
preferred label: characteristic curve @en
related: امتدادهای مشخصه
scope note: هر یک از دو خم مزدوج در یک رویه با این ویژگی که امتدادهای مماس های گذرنده از هر نقطه خم، امتدادهای مشخصه رویه باشد.

هندسه دیفرانسیل خم ها
type: Concept
narrower: خم مشخصه
preferred label: differential geometry of curves @en