نظریه مدول
preferred label: module theory @en
type: Concept
related: مدول توپولوژیک

مدول توپولوژیک
scope note: یک مدول توپولوژیک مدولی روی یک حلقه توپولوژیک است به طوری که جمع و ضرب اسکالر پیوسته هستند.
related: نظریه مدول
broader: جبر توپولوژیک
preferred label: topological module @en
type: Concept

جبر توپولوژیک
preferred label: topological algebra @en
type: Concept
narrower: مدول توپولوژیک