جبر هیلبرت
preferred label: Hilbert algebra @en
type: Concept
narrower: جبر هیلبرت چپ

جبر هیلبرت چپ
scope note: جبری همراه یک برگشت با ضابطه x به x# و یک ضرب داخلی با ویژگی های خاصی است.
broader: جبر هیلبرت
preferred label: left Hilbert algebra @en
type: Concept