فضای باناخ
preferred label: Banach space @en
type: Concept
related: اصل کرانداری یکنواخت

اصل کرانداری یکنواخت
alternative label: قضیه تشدید
scope note: خانواده‌ای از توابع پیوسته حقیقی‌مقدار و نقطه‌ای‌کراندار بر فضای متریک کاملی چون X، بر زیرمجموعه بازی از X یکنواخت کراندار است.
related: فضای باناخ
broader: فضای برداری توپولوژیک
preferred label: uniform boundedness principle @en
type: Concept

فضای برداری توپولوژیک
preferred label: topological vector space @en
type: Concept
narrower: اصل کرانداری یکنواخت