جبر باناخ تعویض‌پذیر
preferred label: commutative Banach algebra @en
type: Concept
related: طیف مانده‌ای

نظریه طیفی
preferred label: spectral theory @en
type: Concept
narrower: طیف مانده‌ای

طیف مانده‌ای
scope note: اعضایی از طیف یک عملگر خطی روی یک فضای باناخ که ویژگی خاصی دارد.
related: جبر باناخ تعویض‌پذیر
broader: نظریه طیفی
preferred label: residual spectrum @en
type: Concept