جبر باناخ تعویض‌پذیر
preferred label: commutative Banach algebra @en
type: Concept
related: طیف نقطه‌ای

نظریه طیفی
preferred label: spectral theory @en
type: Concept
narrower: طیف نقطه‌ای

طیف نقطه‌ای
scope note: ویژه مقدارهایی در طیف یک عملگر خطی بین فضاهای باناخ که ویژه بردارهای متناظرشان ناصفر و دارای نرم متناهی اند.
related: جبر باناخ تعویض‌پذیر
broader: نظریه طیفی
preferred label: point spectrum @en
type: Concept