خطا
preferred label: error @en
type: Concept
narrower: خطای لپی

خطای لپی
scope note: خطایی که به علت دخالت ما در برنامه نویسی، عمل، آماده سازی ورودی و تفسیر خروجی رخ می دهد.
broader: خطا
preferred label: blunder error @en
type: Concept