خطا
preferred label: error @en
type: Concept
narrower: خطای نسبی

خطای نسبی
scope note: خطای نسبی برابر قدر مطلق تفاضل مقدار واقعی و مقدار تقریبی تقسیم بر قدرمطلق مقدار واقعی است.
related: خطای مطلق
broader: خطا
preferred label: relative error @en
type: Concept

خطای مطلق
preferred label: absolute error @en
type: Concept
related: خطای نسبی