تفاضل متناهی
preferred label: finite difference @en
type: Concept
narrower: حساب تفاضل‌های متناهی

حساب تفاضل‌های متناهی
scope note: روشی برای درونیابی مبتنی بر استفاده از روابط صوری بین عملگرهای تفاضلی که آن عملگرها برحسب مقادیر یک تابع بر مجموعه ای از نقاط متساوی الفاصله تعریف می شوند.
broader: تفاضل متناهی
preferred label: calculus of finite differences @en
type: Concept