درون‌یابی اورت
scope note: فرمولی برای برآوردکردن مقدار یک تابع به ازای مقداری میانی از متغیر مستقل وقتی که مقدار تابع در یک رشته از نقاط متساوی الفاصله معلوم باشد و فقط برحسب تفاضل های مرکزی مرتبه زوج تابع و ضریبهایی که توابعی چندجمله ای از متغیر مستقل اند.
broader: درون‌یابی
preferred label: Everett interpolation @en
type: Concept

درون‌یابی
preferred label: interpolation @en
type: Concept
narrower: درون‌یابی اورت