اندازه برداری‌مقدار
scope note: یک اندازه برداری است که روی گردایه ای از مجموعه ها تعریف می شود و مقدار آن بردار است و در شرایط ویژه ای صدق می کند.
related: بردار
broader: اندازه در فضای مجرد
preferred label: vector-valued measure @en
type: Concept

بردار
preferred label: vector @en
type: Concept
related: اندازه برداری‌مقدار

اندازه در فضای مجرد
preferred label: measure in abstract space @en
type: Concept
narrower: اندازه برداری‌مقدار