تاریخ ریاضیات
preferred label: history of mathematics @en
type: Concept
narrower: تاریخ بیرونی ریاضی

تاریخ بیرونی ریاضی
scope note: سیر ریاضیات تحت عوامل بیرونی و سایر علوم.
broader: تاریخ ریاضیات
preferred label: exterior history of math @en
type: Concept