ریاضیات محض
scope note: بررسی درونی ساختارهای ریاضی بدون توجه به کاربرد نتایج آن برای مقاصد عملی.
broader: تاریخ ریاضیات
preferred label: pure mathematics @en
type: Concept

تاریخ ریاضیات
preferred label: history of mathematics @en
type: Concept
narrower: ریاضیات محض