اندازه در فضای نامتناهی‌بعد
preferred label: measure in infinite-dimensional space @en
type: Concept
narrower: اندازه گاوسی

اندازه گاوسی
scope note: اندازه گاوسی یک اندازه بورل روی فضای اقلیدسی با بعد متناهی است که با توزیع نرمال در آمار مرتبط است. البته تعمیم آن به فضاهای با بعد نامتناهی نیز وجود دارد.
broader: اندازه در فضای نامتناهی‌بعد
preferred label: Gaussian measure @en
type: Concept