تبدیل فوریه
preferred label: Fourier transform @en
type: Concept
related: تبدیل هارتلی

تبدیل انتگرالی
preferred label: integral transform @en
type: Concept
narrower: تبدیل هارتلی

تبدیل هارتلی
scope note: متناظر تبدیل فوریه برای مجموعه های حقیقی مقدار و متناهی از داده.
related: تبدیل فوریه
broader: تبدیل انتگرالی
preferred label: Hartley transform @en
type: Concept