قضیه کاراتئودوری
scope note: هر نقطه ارشه محدب یک مجموعه در یک فضای اقلیدسی n بعدی، ترکیب خطی محدبی از نقاط آن مجموعه است.
broader: روش سادکی
preferred label: Caratheodory theorem @en
type: Concept

روش سادکی
preferred label: simplex method @en
type: Concept
narrower: قضیه کاراتئودوری