اندازه بر
scope note: اندازه ای تعریف شده روی رده همه مجموعه های بئر به نحوی که اندازه هر مجموعه بسته فشرده متناهی است.
related: مجموعه بر
broader: انتگرال لبگ
preferred label: Baire measure @en
type: Concept

مجموعه بر
preferred label: Baire set @en
type: Concept
related: اندازه بر

انتگرال لبگ
preferred label: Lebesgue integral @en
type: Concept
narrower: اندازه بر