اندازه داخلی
scope note: اندازه ای که مقدارش روی یک مجموعه S کوچکترین کران بالای اندازه های لبگ مجموعه های بسته واقع در S است.
narrower: اندازه داخلی منظم
broader: انتگرال لبگ
preferred label: inner measure @en
type: Concept

اندازه داخلی منظم
preferred label: regular inner measure @en
type: Concept
broader: اندازه داخلی

انتگرال لبگ
preferred label: Lebesgue integral @en
type: Concept
narrower: اندازه داخلی