آشفته ساز
preferred label: derangment @en
type: Concept
narrower: عدد آشفتگی

عدد آشفتگی
scope note: تعداد جایگشت های یک مجموعه nعضوی که هیچ عضوی از مجموعه را به خودش نمی برند.
related: رابطه بازگشتی
broader: آشفته ساز
preferred label: derangement number @en
type: Concept

رابطه بازگشتی
preferred label: recurrence relation @en
type: Concept
related: عدد آشفتگی