چندآمینو
preferred label: polyomino @en
type: Concept
narrower: پنتومینو

پنتومینو
alternative label: پنج مربعی
scope note: هر یک از 12 شکل مسطحی که می توان با الحاق پنج مربع به طول ضلع واحد به هم ساخت،به طوری که هر دو مربع مجاور یک ضلع مشترک داشته باشد.
broader: چندآمینو
preferred label: pentomino @en
type: Concept