چندآمینو
preferred label: polyomino @en
type: Concept
narrower: هپتومینو

هپتومینو
alternative label: هفت مربعی
scope note: هر یک از 108 شکل مسطحی که می توان با الحاق هفت مربع به ضلع واحد ساخت.
broader: چندآمینو
preferred label: heptomino @en
type: Concept