پوشش گراف
preferred label: graph covering @en
type: Concept
narrower: پوشش دوخوشه‌ای

پوشش دوخوشه‌ای
scope note: اگر خانواده زیرگرافهای دوبخشی، کامل باشد.پوشش را دوخوشه‌ای گویند.
related: خانواده پوشش آزاد
broader: پوشش گراف
preferred label: biclique cover @en
type: Concept

خانواده پوشش آزاد
preferred label: cover free family @en
type: Concept
related: پوشش دوخوشه‌ای