درخت
preferred label: tree(graph) @en
type: Concept
narrower: چگالی درختی

چگالی درختی
scope note: ماکسیسم تعداد درخت‌های فراگیر یال مجزای مشمول درگراف.
broader: درخت
preferred label: tree density @en
type: Concept