ابرگراف جزئی
scope note: ابرگرافی که بعضی از یالهایش حذف شده است.
broader: ابرگراف
preferred label: partial hypergraph @en
type: Concept

ابرگراف
preferred label: hypergraph @en
type: Concept
narrower: ابرگراف جزئی