دسته‌بندی ساختاری گراف‌ها
preferred label: structural characterization of graphs @en
type: Concept
narrower: گراف خاص

گراف خاص
scope note: گراف همبند و دارای حداقل مقادیرویژه بزرگتر یا مساوی منفی2.
related: گراف همبند
broader: دسته‌بندی ساختاری گراف‌ها
preferred label: exeptional graph @en
type: Concept

گراف همبند
preferred label: connected graph @en
type: Concept
related: گراف خاص