دسته‌بندی ساختاری گراف‌ها
preferred label: structural characterization of graphs @en
type: Concept
narrower: گراف دوستی

گراف دوستی
scope note: برای هردو راس متمایز، دقیقا یک راس وجود دارد که به هردوی آنها متصل است.
broader: دسته‌بندی ساختاری گراف‌ها
preferred label: friendship graph @en
type: Concept