دسته‌بندی ساختاری گراف‌ها
preferred label: structural characterization of graphs @en
type: Concept
narrower: متمم گراف

متمم گراف
alternative label: مکمل گراف
scope note: گرافی با همان مجموعه راس، دو راس در آن متصل اند اگر وفقط اگر در گراف اولیه متصل نباشند.
broader: دسته‌بندی ساختاری گراف‌ها
preferred label: complement of a graph @en
type: Concept