یال
preferred label: edge @en
type: Concept
narrower: یال غلبه‌گر

یال غلبه‌گر
scope note: مجموعه ای از یال ها که هر یال گراف یا عضوی ازاین مجموعه یا راسی مشترک با عضوی از این مجموعه دارد.
broader: یال
preferred label: dominanting edge @en
type: Concept