رنگ‌آمیزی کلی
preferred label: total coloring @en
type: Concept
narrower: حدس رنگ‌آمیزی کلی

گراف دو بخشی
preferred label: bipartite graph @en
type: Concept
related: حدس رنگ‌آمیزی کلی

حدس رنگ‌آمیزی کلی
scope note: حدس دکتر بهزاد، هر گراف ساده دارای رنگ آمیزی کلی با حداکثر (ماکزیمم درجات گراف +2) رنگ می باشد.
related: گراف دو بخشی
broader: رنگ‌آمیزی کلی
preferred label: total coloring conjecture @en
type: Concept