رنگ‌آمیزی یالی
preferred label: edge coloring @en
type: Concept
narrower: قضیه ویزینگ

قضیه ویزینگ
scope note: در هر گراف ساده، عدد رنگی یالی حداکثر یکی بیشتر از عدد خوشه گراف است.
broader: رنگ‌آمیزی یالی
preferred label: Vizing theorem @en
type: Concept